﻿パス,詳細図,第1分類,第2分類,第3分類,第4分類,品名,品番,注記,仕様1,仕様2,仕様3,仕様4,仕様5
/KITCHEN/RIC_I65,RMD65L1800syuR,キッチン,システムキッチン,,,リシェルSI,RMD65L1800syuR,R,システムキッチン,間口=1800,I型,,奥行き65cm
/KITCHEN/RIC_I65,RMD65L1800syuL,キッチン,システムキッチン,,,リシェルSI,RMD65L1800syuL,L,システムキッチン,間口=1800,I型,,奥行き65cm
/KITCHEN/RIC_I65,RMD65L1950syuR,キッチン,システムキッチン,,,リシェルSI,RMD65L1950syuR,R,システムキッチン,間口=1950,I型,,奥行き65cm
/KITCHEN/RIC_I65,RMD65L1950syuL,キッチン,システムキッチン,,,リシェルSI,RMD65L1950syuL,L,システムキッチン,間口=1950,I型,,奥行き65cm
/KITCHEN/RIC_I65,RMD65L1950syoR,キッチン,システムキッチン,,,リシェルSI,RMD65L1950syoR,R,システムキッチン,間口=1950,I型,食洗機付,奥行き65cm
/KITCHEN/RIC_I65,RMD65L1950syoL,キッチン,システムキッチン,,,リシェルSI,RMD65L1950syoL,L,システムキッチン,間口=1950,I型,食洗機付,奥行き65cm
/KITCHEN/RIC_I65,RMD65L2100syuR,キッチン,システムキッチン,,,リシェルSI,RMD65L2100syuR,R,システムキッチン,間口=2100,I型,,奥行き65cm
/KITCHEN/RIC_I65,RMD65L2100syuL,キッチン,システムキッチン,,,リシェルSI,RMD65L2100syuL,L,システムキッチン,間口=2100,I型,,奥行き65cm
/KITCHEN/RIC_I65,RMD65L2100syoR,キッチン,システムキッチン,,,リシェルSI,RMD65L2100syoR,R,システムキッチン,間口=2100,I型,食洗機付,奥行き65cm
/KITCHEN/RIC_I65,RMD65L2100syoL,キッチン,システムキッチン,,,リシェルSI,RMD65L2100syoL,L,システムキッチン,間口=2100,I型,食洗機付,奥行き65cm
/KITCHEN/RIC_I65,RMD65L2250syuR,キッチン,システムキッチン,,,リシェルSI,RMD65L2250syuR,R,システムキッチン,間口=2250,I型,,奥行き65cm
/KITCHEN/RIC_I65,RMD65L2250syuL,キッチン,システムキッチン,,,リシェルSI,RMD65L2250syuL,L,システムキッチン,間口=2250,I型,,奥行き65cm
/KITCHEN/RIC_I65,RMD65L2250syoR,キッチン,システムキッチン,,,リシェルSI,RMD65L2250syoR,R,システムキッチン,間口=2250,I型,食洗機付,奥行き65cm
/KITCHEN/RIC_I65,RMD65L2250syoL,キッチン,システムキッチン,,,リシェルSI,RMD65L2250syoL,L,システムキッチン,間口=2250,I型,食洗機付,奥行き65cm
/KITCHEN/RIC_I65,RMD65L2400syuL,キッチン,システムキッチン,,,リシェルSI,RMD65L2400syuL,L,システムキッチン,間口=2400,I型,,奥行き65cm
/KITCHEN/RIC_I65,RMD65L2400syoR,キッチン,システムキッチン,,,リシェルSI,RMD65L2400syoR,R,システムキッチン,間口=2400,I型,食洗機付,奥行き65cm
/KITCHEN/RIC_I65,RMD65L2400syoL,キッチン,システムキッチン,,,リシェルSI,RMD65L2400syoL,L,システムキッチン,間口=2400,I型,食洗機付,奥行き65cm
/KITCHEN/RIC_I65,RMD65L2400syuR,キッチン,システムキッチン,,,リシェルSI,RMD65L2400syuR,R,システムキッチン,間口=2400,I型,,奥行き65cm
/KITCHEN/RIC_I65,RMD65L2550syuR,キッチン,システムキッチン,,,リシェルSI,RMD65L2550syuR,R,システムキッチン,間口=2550,I型,,奥行き65cm
/KITCHEN/RIC_I65,RMD65L2550syuL,キッチン,システムキッチン,,,リシェルSI,RMD65L2550syuL,L,システムキッチン,間口=2550,I型,,奥行き65cm
/KITCHEN/RIC_I65,RMD65L2550syoR,キッチン,システムキッチン,,,リシェルSI,RMD65L2550syoR,R,システムキッチン,間口=2550,I型,食洗機付,奥行き65cm
/KITCHEN/RIC_I65,RMD65L2550syoL,キッチン,システムキッチン,,,リシェルSI,RMD65L2550syoL,L,システムキッチン,間口=2550,I型,食洗機付,奥行き65cm
/KITCHEN/RIC_I65,RMD65L2600syuR,キッチン,システムキッチン,,,リシェルSI,RMD65L2600syuR,R,システムキッチン,間口=2600,I型,,奥行き65cm
/KITCHEN/RIC_I65,RMD65L2600syuL,キッチン,システムキッチン,,,リシェルSI,RMD65L2600syuL,L,システムキッチン,間口=2600,I型,,奥行き65cm
/KITCHEN/RIC_I65,RMD65L2600syoL,キッチン,システムキッチン,,,リシェルSI,RMD65L2600syoL,L,システムキッチン,間口=2600,I型,食洗機付,奥行き65cm
/KITCHEN/RIC_I65,RMD65L2600syoR,キッチン,システムキッチン,,,リシェルSI,RMD65L2600syoR,R,システムキッチン,間口=2600,I型,食洗機付,奥行き65cm
/KITCHEN/RIC_I65,RMD65L2700syuL,キッチン,システムキッチン,,,リシェルSI,RMD65L2700syuL,L,システムキッチン,間口=2700,I型,,奥行き65cm
/KITCHEN/RIC_I65,RMD65L2700syuR,キッチン,システムキッチン,,,リシェルSI,RMD65L2700syuR,R,システムキッチン,間口=2700,I型,,奥行き65cm
/KITCHEN/RIC_I65,RMD65L2700syoR,キッチン,システムキッチン,,,リシェルSI,RMD65L2700syoR,R,システムキッチン,間口=2700,I型,食洗機付,奥行き65cm
/KITCHEN/RIC_I65,RMD65L2700syoL,キッチン,システムキッチン,,,リシェルSI,RMD65L2700syoL,L,システムキッチン,間口=2700,I型,食洗機付,奥行き65cm
/KITCHEN/RIC_I65,RMD65L2850syuR,キッチン,システムキッチン,,,リシェルSI,RMD65L2850syuR,R,システムキッチン,間口=2850,I型,,奥行き65cm
/KITCHEN/RIC_I65,RMD65L2850syuL,キッチン,システムキッチン,,,リシェルSI,RMD65L2850syuL,L,システムキッチン,間口=2850,I型,,奥行き65cm
/KITCHEN/RIC_I65,RMD65L2850syoR,キッチン,システムキッチン,,,リシェルSI,RMD65L2850syoR,R,システムキッチン,間口=2850,I型,食洗機付,奥行き65cm
/KITCHEN/RIC_I65,RMD65L2850syoL,キッチン,システムキッチン,,,リシェルSI,RMD65L2850syoL,L,システムキッチン,間口=2850,I型,食洗機付,奥行き65cm
/KITCHEN/RIC_I65,RMD65L3000syuR,キッチン,システムキッチン,,,リシェルSI,RMD65L3000syuR,R,システムキッチン,間口=3000,I型,,奥行き65cm
/KITCHEN/RIC_I65,RMD65L3000syuL,キッチン,システムキッチン,,,リシェルSI,RMD65L3000syuL,L,システムキッチン,間口=3000,I型,,奥行き65cm
/KITCHEN/RIC_I65,RMD65L3000syoR,キッチン,システムキッチン,,,リシェルSI,RMD65L3000syoR,R,システムキッチン,間口=3000,I型,食洗機付,奥行き65cm
/KITCHEN/RIC_I65,RMD65L3000syoL,キッチン,システムキッチン,,,リシェルSI,RMD65L3000syoL,L,システムキッチン,間口=3000,I型,食洗機付,奥行き65cm
/KITCHEN/RIC_L21,RMD65L1816syuR,キッチン,システムキッチン,,,リシェルSI,RMD65L1816syuR,R,システムキッチン,間口=シンク側1800×コンロ側1650,L型,,奥行き65cm
/KITCHEN/RIC_L21,RMD65L1816syuL,キッチン,システムキッチン,,,リシェルSI,RMD65L1816syuL,L,システムキッチン,間口=シンク側1800×コンロ側1650,L型,,奥行き65cm
/KITCHEN/RIC_L21,RMD65L1818syuR,キッチン,システムキッチン,,,リシェルSI,RMD65L1818syuR,R,システムキッチン,間口=シンク側1800×コンロ側1800,L型,,奥行き65cm
/KITCHEN/RIC_L21,RMD65L1818syuL,キッチン,システムキッチン,,,リシェルSI,RMD65L1818syuL,L,システムキッチン,間口=シンク側1800×コンロ側1800,L型,,奥行き65cm
/KITCHEN/RIC_L21,RMD65L1819syuR,キッチン,システムキッチン,,,リシェルSI,RMD65L1819syuR,R,システムキッチン,間口=シンク側1800×コンロ側1950,L型,,奥行き65cm
/KITCHEN/RIC_L21,RMD65L1819syuL,キッチン,システムキッチン,,,リシェルSI,RMD65L1819syuL,L,システムキッチン,間口=シンク側1800×コンロ側1950,L型,,奥行き65cm
/KITCHEN/RIC_L21,RMD65L1916syuR,キッチン,システムキッチン,,,リシェルSI,RMD65L1916syuR,R,システムキッチン,間口=シンク側1950×コンロ側1650,L型,,奥行き65cm
/KITCHEN/RIC_L21,RMD65L1916syuL,キッチン,システムキッチン,,,リシェルSI,RMD65L1916syuL,L,システムキッチン,間口=シンク側1950×コンロ側1650,L型,,奥行き65cm
/KITCHEN/RIC_L21,RMD65L1916syoR,キッチン,システムキッチン,,,リシェルSI,RMD65L1916syoR,R,システムキッチン,間口=シンク側1950×コンロ側1650,L型,食洗機付,奥行き65cm
/KITCHEN/RIC_L21,RMD65L1916syoL,キッチン,システムキッチン,,,リシェルSI,RMD65L1916syoL,L,システムキッチン,間口=シンク側1950×コンロ側1650,L型,食洗機付,奥行き65cm
/KITCHEN/RIC_L21,RMD65L1918syuR,キッチン,システムキッチン,,,リシェルSI,RMD65L1918syuR,R,システムキッチン,間口=シンク側1950×コンロ側1800,L型,,奥行き65cm
/KITCHEN/RIC_L21,RMD65L1918syuL,キッチン,システムキッチン,,,リシェルSI,RMD65L1918syuL,L,システムキッチン,間口=シンク側1950×コンロ側1800,L型,,奥行き65cm
/KITCHEN/RIC_L21,RMD65L1918syoR,キッチン,システムキッチン,,,リシェルSI,RMD65L1918syoR,R,システムキッチン,間口=シンク側1950×コンロ側1800,L型,食洗機付,奥行き65cm
/KITCHEN/RIC_L21,RMD65L1918syoL,キッチン,システムキッチン,,,リシェルSI,RMD65L1918syoL,L,システムキッチン,間口=シンク側1950×コンロ側1800,L型,食洗機付,奥行き65cm
/KITCHEN/RIC_L21,RMD65L1919syuR,キッチン,システムキッチン,,,リシェルSI,RMD65L1919syuR,R,システムキッチン,間口=シンク側1950×コンロ側1950,L型,,奥行き65cm
/KITCHEN/RIC_L21,RMD65L1919syuL,キッチン,システムキッチン,,,リシェルSI,RMD65L1919syuL,L,システムキッチン,間口=シンク側1950×コンロ側1950,L型,,奥行き65cm
/KITCHEN/RIC_L21,RMD65L1919syoR,キッチン,システムキッチン,,,リシェルSI,RMD65L1919syoR,R,システムキッチン,間口=シンク側1950×コンロ側1950,L型,食洗機付,奥行き65cm
/KITCHEN/RIC_L21,RMD65L1919syoL,キッチン,システムキッチン,,,リシェルSI,RMD65L1919syoL,L,システムキッチン,間口=シンク側1950×コンロ側1950,L型,食洗機付,奥行き65cm
/KITCHEN/RIC_L21,RMD65L2116syuR,キッチン,システムキッチン,,,リシェルSI,RMD65L2116syuR,R,システムキッチン,間口=シンク側2100×コンロ側1650,L型,,奥行き65cm
/KITCHEN/RIC_L21,RMD65L2116syuL,キッチン,システムキッチン,,,リシェルSI,RMD65L2116syuL,L,システムキッチン,間口=シンク側2100×コンロ側1650,L型,,奥行き65cm
/KITCHEN/RIC_L21,RMD65L2116syoR,キッチン,システムキッチン,,,リシェルSI,RMD65L2116syoR,R,システムキッチン,間口=シンク側2100×コンロ側1650,L型,食洗機付,奥行き65cm
/KITCHEN/RIC_L21,RMD65L2116syoL,キッチン,システムキッチン,,,リシェルSI,RMD65L2116syoL,L,システムキッチン,間口=シンク側2100×コンロ側1650,L型,食洗機付,奥行き65cm
/KITCHEN/RIC_L21,RMD65L2118syuR,キッチン,システムキッチン,,,リシェルSI,RMD65L2118syuR,R,システムキッチン,間口=シンク側2100×コンロ側1800,L型,,奥行き65cm
/KITCHEN/RIC_L21,RMD65L2118syuL,キッチン,システムキッチン,,,リシェルSI,RMD65L2118syuL,L,システムキッチン,間口=シンク側2100×コンロ側1800,L型,,奥行き65cm
/KITCHEN/RIC_L21,RMD65L2118syoR,キッチン,システムキッチン,,,リシェルSI,RMD65L2118syoR,R,システムキッチン,間口=シンク側2100×コンロ側1800,L型,食洗機付,奥行き65cm
/KITCHEN/RIC_L21,RMD65L2118syoL,キッチン,システムキッチン,,,リシェルSI,RMD65L2118syoL,L,システムキッチン,間口=シンク側2100×コンロ側1800,L型,食洗機付,奥行き65cm
/KITCHEN/RIC_L21,RMD65L2119syuR,キッチン,システムキッチン,,,リシェルSI,RMD65L2119syuR,R,システムキッチン,間口=シンク側2100×コンロ側1950,L型,,奥行き65cm
/KITCHEN/RIC_L21,RMD65L2119syuL,キッチン,システムキッチン,,,リシェルSI,RMD65L2119syuL,L,システムキッチン,間口=シンク側2100×コンロ側1950,L型,,奥行き65cm
/KITCHEN/RIC_L21,RMD65L2119syoR,キッチン,システムキッチン,,,リシェルSI,RMD65L2119syoR,R,システムキッチン,間口=シンク側2100×コンロ側1950,L型,食洗機付,奥行き65cm
/KITCHEN/RIC_L21,RMD65L2119syoL,キッチン,システムキッチン,,,リシェルSI,RMD65L2119syoL,L,システムキッチン,間口=シンク側2100×コンロ側1950,L型,食洗機付,奥行き65cm
/KITCHEN/RIC_L27,RMD65L2216syuR,キッチン,システムキッチン,,,リシェルSI,RMD65L2216syuR,R,システムキッチン,間口=シンク側2250×コンロ側1650,L型,,奥行き65cm
/KITCHEN/RIC_L27,RMD65L2216syuL,キッチン,システムキッチン,,,リシェルSI,RMD65L2216syuL,L,システムキッチン,間口=シンク側2250×コンロ側1650,L型,,奥行き65cm
/KITCHEN/RIC_L27,RMD65L2216syoR,キッチン,システムキッチン,,,リシェルSI,RMD65L2216syoR,R,システムキッチン,間口=シンク側2250×コンロ側1650,L型,食洗機付,奥行き65cm
/KITCHEN/RIC_L27,RMD65L2216syoL,キッチン,システムキッチン,,,リシェルSI,RMD65L2216syoL,L,システムキッチン,間口=シンク側2250×コンロ側1650,L型,食洗機付,奥行き65cm
/KITCHEN/RIC_L27,RMD65L2218syuR,キッチン,システムキッチン,,,リシェルSI,RMD65L2218syuR,R,システムキッチン,間口=シンク側2250×コンロ側1800,L型,,奥行き65cm
/KITCHEN/RIC_L27,RMD65L2218syuL,キッチン,システムキッチン,,,リシェルSI,RMD65L2218syuL,L,システムキッチン,間口=シンク側2250×コンロ側1800,L型,,奥行き65cm
/KITCHEN/RIC_L27,RMD65L2218syoR,キッチン,システムキッチン,,,リシェルSI,RMD65L2218syoR,R,システムキッチン,間口=シンク側2250×コンロ側1800,L型,食洗機付,奥行き65cm
/KITCHEN/RIC_L27,RMD65L2218syoL,キッチン,システムキッチン,,,リシェルSI,RMD65L2218syoL,L,システムキッチン,間口=シンク側2250×コンロ側1800,L型,食洗機付,奥行き65cm
/KITCHEN/RIC_L27,RMD65L2219syuR,キッチン,システムキッチン,,,リシェルSI,RMD65L2219syuR,R,システムキッチン,間口=シンク側2250×コンロ側1950,L型,,奥行き65cm
/KITCHEN/RIC_L27,RMD65L2219syuL,キッチン,システムキッチン,,,リシェルSI,RMD65L2219syuL,L,システムキッチン,間口=シンク側2250×コンロ側1950,L型,,奥行き65cm
/KITCHEN/RIC_L27,RMD65L2219syoR,キッチン,システムキッチン,,,リシェルSI,RMD65L2219syoR,R,システムキッチン,間口=シンク側2250×コンロ側1950,L型,食洗機付,奥行き65cm
/KITCHEN/RIC_L27,RMD65L2219syoL,キッチン,システムキッチン,,,リシェルSI,RMD65L2219syoL,L,システムキッチン,間口=シンク側2250×コンロ側1950,L型,食洗機付,奥行き65cm
/KITCHEN/RIC_L27,RMD65L2416syuR,キッチン,システムキッチン,,,リシェルSI,RMD65L2416syuR,R,システムキッチン,間口=シンク側2400×コンロ側1650,L型,,奥行き65cm
/KITCHEN/RIC_L27,RMD65L2416syuL,キッチン,システムキッチン,,,リシェルSI,RMD65L2416syuL,L,システムキッチン,間口=シンク側2400×コンロ側1650,L型,,奥行き65cm
/KITCHEN/RIC_L27,RMD65L2416syoR,キッチン,システムキッチン,,,リシェルSI,RMD65L2416syoR,R,システムキッチン,間口=シンク側2400×コンロ側1650,L型,食洗機付,奥行き65cm
/KITCHEN/RIC_L27,RMD65L2416syoL,キッチン,システムキッチン,,,リシェルSI,RMD65L2416syoL,L,システムキッチン,間口=シンク側2400×コンロ側1650,L型,食洗機付,奥行き65cm
/KITCHEN/RIC_L27,RMD65L2418syuR,キッチン,システムキッチン,,,リシェルSI,RMD65L2418syuR,R,システムキッチン,間口=シンク側2400×コンロ側1800,L型,,奥行き65cm
/KITCHEN/RIC_L27,RMD65L2418syuL,キッチン,システムキッチン,,,リシェルSI,RMD65L2418syuL,L,システムキッチン,間口=シンク側2400×コンロ側1800,L型,,奥行き65cm
/KITCHEN/RIC_L27,RMD65L2418syoR,キッチン,システムキッチン,,,リシェルSI,RMD65L2418syoR,R,システムキッチン,間口=シンク側2400×コンロ側1800,L型,食洗機付,奥行き65cm
/KITCHEN/RIC_L27,RMD65L2418syoL,キッチン,システムキッチン,,,リシェルSI,RMD65L2418syoL,L,システムキッチン,間口=シンク側2400×コンロ側1800,L型,食洗機付,奥行き65cm
/KITCHEN/RIC_L27,RMD65L2419syuR,キッチン,システムキッチン,,,リシェルSI,RMD65L2419syuR,R,システムキッチン,間口=シンク側2400×コンロ側1950,L型,,奥行き65cm
/KITCHEN/RIC_L27,RMD65L2419syuL,キッチン,システムキッチン,,,リシェルSI,RMD65L2419syuL,L,システムキッチン,間口=シンク側2400×コンロ側1950,L型,,奥行き65cm
/KITCHEN/RIC_L27,RMD65L2419syoR,キッチン,システムキッチン,,,リシェルSI,RMD65L2419syoR,R,システムキッチン,間口=シンク側2400×コンロ側1950,L型,食洗機付,奥行き65cm
/KITCHEN/RIC_L27,RMD65L2419syoL,キッチン,システムキッチン,,,リシェルSI,RMD65L2419syoL,L,システムキッチン,間口=シンク側2400×コンロ側1950,L型,食洗機付,奥行き65cm
/KITCHEN/RIC_L27,RMD65L2516syuR,キッチン,システムキッチン,,,リシェルSI,RMD65L2516syuR,R,システムキッチン,間口=シンク側2550×コンロ側1650,L型,,奥行き65cm
/KITCHEN/RIC_L27,RMD65L2516syuL,キッチン,システムキッチン,,,リシェルSI,RMD65L2516syuL,L,システムキッチン,間口=シンク側2550×コンロ側1650,L型,,奥行き65cm
/KITCHEN/RIC_L27,RMD65L2516syoR,キッチン,システムキッチン,,,リシェルSI,RMD65L2516syoR,R,システムキッチン,間口=シンク側2550×コンロ側1650,L型,食洗機付,奥行き65cm
/KITCHEN/RIC_L27,RMD65L2516syoL,キッチン,システムキッチン,,,リシェルSI,RMD65L2516syoL,L,システムキッチン,間口=シンク側2550×コンロ側1650,L型,食洗機付,奥行き65cm
/KITCHEN/RIC_L27,RMD65L2518syuR,キッチン,システムキッチン,,,リシェルSI,RMD65L2518syuR,R,システムキッチン,間口=シンク側2550×コンロ側1800,L型,,奥行き65cm
/KITCHEN/RIC_L27,RMD65L2518syuL,キッチン,システムキッチン,,,リシェルSI,RMD65L2518syuL,L,システムキッチン,間口=シンク側2550×コンロ側1800,L型,,奥行き65cm
/KITCHEN/RIC_L27,RMD65L2518syoR,キッチン,システムキッチン,,,リシェルSI,RMD65L2518syoR,R,システムキッチン,間口=シンク側2550×コンロ側1800,L型,食洗機付,奥行き65cm
/KITCHEN/RIC_L27,RMD65L2518syoL,キッチン,システムキッチン,,,リシェルSI,RMD65L2518syoL,L,システムキッチン,間口=シンク側2550×コンロ側1800,L型,食洗機付,奥行き65cm
/KITCHEN/RIC_L27,RMD65L2519syuR,キッチン,システムキッチン,,,リシェルSI,RMD65L2519syuR,R,システムキッチン,間口=シンク側2550×コンロ側1950,L型,,奥行き65cm
/KITCHEN/RIC_L27,RMD65L2519syuL,キッチン,システムキッチン,,,リシェルSI,RMD65L2519syuL,L,システムキッチン,間口=シンク側2550×コンロ側1950,L型,,奥行き65cm
/KITCHEN/RIC_L27,RMD65L2519syoR,キッチン,システムキッチン,,,リシェルSI,RMD65L2519syoR,R,システムキッチン,間口=シンク側2550×コンロ側1950,L型,食洗機付,奥行き65cm
/KITCHEN/RIC_L27,RMD65L2519syoL,キッチン,システムキッチン,,,リシェルSI,RMD65L2519syoL,L,システムキッチン,間口=シンク側2550×コンロ側1950,L型,食洗機付,奥行き65cm
/KITCHEN/RIC_L27,RMD65L2716syuR,キッチン,システムキッチン,,,リシェルSI,RMD65L2716syuR,R,システムキッチン,間口=シンク側2700×コンロ側1650,L型,,奥行き65cm
/KITCHEN/RIC_L27,RMD65L2716syuL,キッチン,システムキッチン,,,リシェルSI,RMD65L2716syuL,L,システムキッチン,間口=シンク側2700×コンロ側1650,L型,,奥行き65cm
/KITCHEN/RIC_L27,RMD65L2716syoR,キッチン,システムキッチン,,,リシェルSI,RMD65L2716syoR,R,システムキッチン,間口=シンク側2700×コンロ側1650,L型,食洗機付,奥行き65cm
/KITCHEN/RIC_L27,RMD65L2716syoL,キッチン,システムキッチン,,,リシェルSI,RMD65L2716syoL,L,システムキッチン,間口=シンク側2700×コンロ側1650,L型,食洗機付,奥行き65cm
/KITCHEN/RIC_L27,RMD65L2718syuR,キッチン,システムキッチン,,,リシェルSI,RMD65L2718syuR,R,システムキッチン,間口=シンク側2700×コンロ側1800,L型,,奥行き65cm
/KITCHEN/RIC_L27,RMD65L2718syuL,キッチン,システムキッチン,,,リシェルSI,RMD65L2718syuL,L,システムキッチン,間口=シンク側2700×コンロ側1800,L型,,奥行き65cm
/KITCHEN/RIC_L27,RMD65L2718syoR,キッチン,システムキッチン,,,リシェルSI,RMD65L2718syoR,R,システムキッチン,間口=シンク側2700×コンロ側1800,L型,食洗機付,奥行き65cm
/KITCHEN/RIC_L27,RMD65L2718syoL,キッチン,システムキッチン,,,リシェルSI,RMD65L2718syoL,L,システムキッチン,間口=シンク側2700×コンロ側1800,L型,食洗機付,奥行き65cm
/KITCHEN/RIC_L27,RMD65L2719syuR,キッチン,システムキッチン,,,リシェルSI,RMD65L2719syuR,R,システムキッチン,間口=シンク側2700×コンロ側1950,L型,,奥行き65cm
/KITCHEN/RIC_L27,RMD65L2719syuL,キッチン,システムキッチン,,,リシェルSI,RMD65L2719syuL,L,システムキッチン,間口=シンク側2700×コンロ側1950,L型,,奥行き65cm
/KITCHEN/RIC_L27,RMD65L2719syoR,キッチン,システムキッチン,,,リシェルSI,RMD65L2719syoR,R,システムキッチン,間口=シンク側2700×コンロ側1950,L型,食洗機付,奥行き65cm
/KITCHEN/RIC_L27,RMD65L2719syoL,キッチン,システムキッチン,,,リシェルSI,RMD65L2719syoL,L,システムキッチン,間口=シンク側2700×コンロ側1950,L型,食洗機付,奥行き65cm
/KITCHEN/RIC_I60,RMD60L1800syuR,キッチン,システムキッチン,,,リシェルSI,RMD60L1800syuR,R,システムキッチン,間口=1800,I型,,奥行き60cm
/KITCHEN/RIC_I60,RMD60L1800syuL,キッチン,システムキッチン,,,リシェルSI,RMD60L1800syuL,L,システムキッチン,間口=1800,I型,,奥行き60cm
/KITCHEN/RIC_I60,RMD60L1800syoR,キッチン,システムキッチン,,,リシェルSI,RMD60L1800syoR,R,システムキッチン,間口=1800,I型,食洗機付,奥行き60cm
/KITCHEN/RIC_I60,RMD60L1800syoL,キッチン,システムキッチン,,,リシェルSI,RMD60L1800syoL,L,システムキッチン,間口=1800,I型,食洗機付,奥行き60cm
/KITCHEN/RIC_I60,RMD60L1950syuR,キッチン,システムキッチン,,,リシェルSI,RMD60L1950syuR,R,システムキッチン,間口=1950,I型,,奥行き60cm
/KITCHEN/RIC_I60,RMD60L1950syuL,キッチン,システムキッチン,,,リシェルSI,RMD60L1950syuL,L,システムキッチン,間口=1950,I型,,奥行き60cm
/KITCHEN/RIC_I60,RMD60L1950syoR,キッチン,システムキッチン,,,リシェルSI,RMD60L1950syoR,R,システムキッチン,間口=1950,I型,食洗機付,奥行き60cm
/KITCHEN/RIC_I60,RMD60L1950syoL,キッチン,システムキッチン,,,リシェルSI,RMD60L1950syoL,L,システムキッチン,間口=1950,I型,食洗機付,奥行き60cm
/KITCHEN/RIC_I60,RMD60L2100syuR,キッチン,システムキッチン,,,リシェルSI,RMD60L2100syuR,R,システムキッチン,間口=2100,I型,,奥行き60cm
/KITCHEN/RIC_I60,RMD60L2100syuL,キッチン,システムキッチン,,,リシェルSI,RMD60L2100syuL,L,システムキッチン,間口=2100,I型,,奥行き60cm
/KITCHEN/RIC_I60,RMD60L2100syoR,キッチン,システムキッチン,,,リシェルSI,RMD60L2100syoR,R,システムキッチン,間口=2100,I型,食洗機付,奥行き60cm
/KITCHEN/RIC_I60,RMD60L2100syoL,キッチン,システムキッチン,,,リシェルSI,RMD60L2100syoL,L,システムキッチン,間口=2100,I型,食洗機付,奥行き60cm
/KITCHEN/RIC_I60,RMD60L2250syuR,キッチン,システムキッチン,,,リシェルSI,RMD60L2250syuR,R,システムキッチン,間口=2250,I型,,奥行き60cm
/KITCHEN/RIC_I60,RMD60L2250syuL,キッチン,システムキッチン,,,リシェルSI,RMD60L2250syuL,L,システムキッチン,間口=2250,I型,,奥行き60cm
/KITCHEN/RIC_I60,RMD60L2250syoR,キッチン,システムキッチン,,,リシェルSI,RMD60L2250syoR,R,システムキッチン,間口=2250,I型,食洗機付,奥行き60cm
/KITCHEN/RIC_I60,RMD60L2250syoL,キッチン,システムキッチン,,,リシェルSI,RMD60L2250syoL,L,システムキッチン,間口=2250,I型,食洗機付,奥行き60cm
/KITCHEN/RIC_I60,RMD60L2400syuR,キッチン,システムキッチン,,,リシェルSI,RMD60L2400syuR,R,システムキッチン,間口=2400,I型,,奥行き60cm
/KITCHEN/RIC_I60,RMD60L2400syuL,キッチン,システムキッチン,,,リシェルSI,RMD60L2400syuL,L,システムキッチン,間口=2400,I型,,奥行き60cm
/KITCHEN/RIC_I60,RMD60L2400syoR,キッチン,システムキッチン,,,リシェルSI,RMD60L2400syoR,R,システムキッチン,間口=2400,I型,食洗機付,奥行き60cm
/KITCHEN/RIC_I60,RMD60L2400syoL,キッチン,システムキッチン,,,リシェルSI,RMD60L2400syoL,L,システムキッチン,間口=2400,I型,食洗機付,奥行き60cm
/KITCHEN/RIC_I60,RMD60L2550syuR,キッチン,システムキッチン,,,リシェルSI,RMD60L2550syuR,R,システムキッチン,間口=2550,I型,,奥行き60cm
/KITCHEN/RIC_I60,RMD60L2550syuL,キッチン,システムキッチン,,,リシェルSI,RMD60L2550syuL,L,システムキッチン,間口=2550,I型,,奥行き60cm
/KITCHEN/RIC_I60,RMD60L2550syoR,キッチン,システムキッチン,,,リシェルSI,RMD60L2550syoR,R,システムキッチン,間口=2550,I型,食洗機付,奥行き60cm
/KITCHEN/RIC_I60,RMD60L2550syoL,キッチン,システムキッチン,,,リシェルSI,RMD60L2550syoL,L,システムキッチン,間口=2550,I型,食洗機付,奥行き60cm
/KITCHEN/RIC_I60,RMD60L2700syuR,キッチン,システムキッチン,,,リシェルSI,RMD60L2700syuR,R,システムキッチン,間口=2700,I型,,奥行き60cm
/KITCHEN/RIC_I60,RMD60L2700syuL,キッチン,システムキッチン,,,リシェルSI,RMD60L2700syuL,L,システムキッチン,間口=2700,I型,,奥行き60cm
/KITCHEN/RIC_I60,RMD60L2700syoR,キッチン,システムキッチン,,,リシェルSI,RMD60L2700syoR,R,システムキッチン,間口=2700,I型,食洗機付,奥行き60cm
/KITCHEN/RIC_I60,RMD60L2700syoL,キッチン,システムキッチン,,,リシェルSI,RMD60L2700syoL,L,システムキッチン,間口=2700,I型,食洗機付,奥行き60cm
/KITCHEN/RIC_I60,RMD60L2850syuR,キッチン,システムキッチン,,,リシェルSI,RMD60L2850syuR,R,システムキッチン,間口=2850,I型,,奥行き60cm
/KITCHEN/RIC_I60,RMD60L2850syuL,キッチン,システムキッチン,,,リシェルSI,RMD60L2850syuL,L,システムキッチン,間口=2850,I型,,奥行き60cm
/KITCHEN/RIC_I60,RMD60L2850syoR,キッチン,システムキッチン,,,リシェルSI,RMD60L2850syoR,R,システムキッチン,間口=2850,I型,食洗機付,奥行き60cm
/KITCHEN/RIC_I60,RMD60L2850syoL,キッチン,システムキッチン,,,リシェルSI,RMD60L2850syoL,L,システムキッチン,間口=2850,I型,食洗機付,奥行き60cm
/KITCHEN/RIC_I60,RMD60L3000syuR,キッチン,システムキッチン,,,リシェルSI,RMD60L3000syuR,R,システムキッチン,間口=3000,I型,,奥行き60cm
/KITCHEN/RIC_I60,RMD60L3000syuL,キッチン,システムキッチン,,,リシェルSI,RMD60L3000syuL,L,システムキッチン,間口=3000,I型,,奥行き60cm
/KITCHEN/RIC_I60,RMD60L3000syoR,キッチン,システムキッチン,,,リシェルSI,RMD60L3000syoR,R,システムキッチン,間口=3000,I型,食洗機付,奥行き60cm
/KITCHEN/RIC_I60,RMD60L3000syoL,キッチン,システムキッチン,,,リシェルSI,RMD60L3000syoL,L,システムキッチン,間口=3000,I型,食洗機付,奥行き60cm
/KITCHEN/RIC_SP97,RPI97L1985syuR,キッチン,システムキッチン,,,リシェルSI,RPI97L1985syuR,R,システムキッチン,間口=1985,対面I型,,奥行き97cm
/KITCHEN/RIC_SP97,RPI97L1985syuL,キッチン,システムキッチン,,,リシェルSI,RPI97L1985syuL,L,システムキッチン,間口=1985,対面I型,,奥行き97cm
/KITCHEN/RIC_SP97,RPI97L1985syoR,キッチン,システムキッチン,,,リシェルSI,RPI97L1985syoR,R,システムキッチン,間口=1985,対面I型,食洗機付,奥行き97cm
/KITCHEN/RIC_SP97,RPI97L1985syoL,キッチン,システムキッチン,,,リシェルSI,RPI97L1985syoL,L,システムキッチン,間口=1985,対面I型,食洗機付,奥行き97cm
/KITCHEN/RIC_SP97,RPI97L2135syuR,キッチン,システムキッチン,,,リシェルSI,RPI97L2135syuR,R,システムキッチン,間口=2135,対面I型,,奥行き97cm
/KITCHEN/RIC_SP97,RPI97L2135syuL,キッチン,システムキッチン,,,リシェルSI,RPI97L2135syuL,L,システムキッチン,間口=2135,対面I型,,奥行き97cm
/KITCHEN/RIC_SP97,RPI97L2135syoR,キッチン,システムキッチン,,,リシェルSI,RPI97L2135syoR,R,システムキッチン,間口=2135,対面I型,食洗機付,奥行き97cm
/KITCHEN/RIC_SP97,RPI97L2135syoL,キッチン,システムキッチン,,,リシェルSI,RPI97L2135syoL,L,システムキッチン,間口=2135,対面I型,食洗機付,奥行き97cm
/KITCHEN/RIC_SP97,RPI97L2285syuR,キッチン,システムキッチン,,,リシェルSI,RPI97L2285syuR,R,システムキッチン,間口=2285,対面I型,,奥行き97cm
/KITCHEN/RIC_SP97,RPI97L2285syuL,キッチン,システムキッチン,,,リシェルSI,RPI97L2285syuL,L,システムキッチン,間口=2285,対面I型,,奥行き97cm
/KITCHEN/RIC_SP97,RPI97L2285syoR,キッチン,システムキッチン,,,リシェルSI,RPI97L2285syoR,R,システムキッチン,間口=2285,対面I型,食洗機付,奥行き97cm
/KITCHEN/RIC_SP97,RPI97L2285syoL,キッチン,システムキッチン,,,リシェルSI,RPI97L2285syoL,L,システムキッチン,間口=2285,対面I型,食洗機付,奥行き97cm
/KITCHEN/RIC_SP97,RPI97L2435syuR,キッチン,システムキッチン,,,リシェルSI,RPI97L2435syuR,R,システムキッチン,間口=2435,対面I型,,奥行き97cm
/KITCHEN/RIC_SP97,RPI97L2435syuL,キッチン,システムキッチン,,,リシェルSI,RPI97L2435syuL,L,システムキッチン,間口=2435,対面I型,,奥行き97cm
/KITCHEN/RIC_SP97,RPI97L2435syoR,キッチン,システムキッチン,,,リシェルSI,RPI97L2435syoR,R,システムキッチン,間口=2435,対面I型,食洗機付,奥行き97cm
/KITCHEN/RIC_SP97,RPI97L2435syoL,キッチン,システムキッチン,,,リシェルSI,RPI97L2435syoL,L,システムキッチン,間口=2435,対面I型,食洗機付,奥行き97cm
/KITCHEN/RIC_SP97,RPI97L2585syuR,キッチン,システムキッチン,,,リシェルSI,RPI97L2585syuR,R,システムキッチン,間口=2585,対面I型,,奥行き97cm
/KITCHEN/RIC_SP97,RPI97L2585syuL,キッチン,システムキッチン,,,リシェルSI,RPI97L2585syuL,L,システムキッチン,間口=2585,対面I型,,奥行き97cm
/KITCHEN/RIC_SP97,RPI97L2585syoR,キッチン,システムキッチン,,,リシェルSI,RPI97L2585syoR,R,システムキッチン,間口=2585,対面I型,食洗機付,奥行き97cm
/KITCHEN/RIC_SP97,RPI97L2585syoL,キッチン,システムキッチン,,,リシェルSI,RPI97L2585syoL,L,システムキッチン,間口=2585,対面I型,食洗機付,奥行き97cm
/KITCHEN/RIC_SP97,RPI97L2735syuR,キッチン,システムキッチン,,,リシェルSI,RPI97L2735syuR,R,システムキッチン,間口=2735,対面I型,,奥行き97cm
/KITCHEN/RIC_SP97,RPI97L2735syuL,キッチン,システムキッチン,,,リシェルSI,RPI97L2735syuL,L,システムキッチン,間口=2735,対面I型,,奥行き97cm
/KITCHEN/RIC_SP97,RPI97L2735syoR,キッチン,システムキッチン,,,リシェルSI,RPI97L2735syoR,R,システムキッチン,間口=2735,対面I型,食洗機付,奥行き97cm
/KITCHEN/RIC_SP97,RPI97L2735syoL,キッチン,システムキッチン,,,リシェルSI,RPI97L2735syoL,L,システムキッチン,間口=2735,対面I型,食洗機付,奥行き97cm
/KITCHEN/RIC_SI97,RIL97L2020syuR,キッチン,システムキッチン,,,リシェルSI,RIL97L2020syuR,R,システムキッチン,間口=2020,対面I型,,奥行き97cm
/KITCHEN/RIC_SI97,RIL97L2020syuL,キッチン,システムキッチン,,,リシェルSI,RIL97L2020syuL,L,システムキッチン,間口=2020,対面I型,,奥行き97cm
/KITCHEN/RIC_SI97,RIL97L2020syoR,キッチン,システムキッチン,,,リシェルSI,RIL97L2020syoR,R,システムキッチン,間口=2020,対面I型,食洗機付,奥行き97cm
/KITCHEN/RIC_SI97,RIL97L2020syoL,キッチン,システムキッチン,,,リシェルSI,RIL97L2020syoL,L,システムキッチン,間口=2020,対面I型,食洗機付,奥行き97cm
/KITCHEN/RIC_SI97,RIL97L2170syuR,キッチン,システムキッチン,,,リシェルSI,RIL97L2170syuR,R,システムキッチン,間口=2170,対面I型,,奥行き97cm
/KITCHEN/RIC_SI97,RIL97L2170syuL,キッチン,システムキッチン,,,リシェルSI,RIL97L2170syuL,L,システムキッチン,間口=2170,対面I型,,奥行き97cm
/KITCHEN/RIC_SI97,RIL97L2170syoR,キッチン,システムキッチン,,,リシェルSI,RIL97L2170syoR,R,システムキッチン,間口=2170,対面I型,食洗機付,奥行き97cm
/KITCHEN/RIC_SI97,RIL97L2170syoL,キッチン,システムキッチン,,,リシェルSI,RIL97L2170syoL,L,システムキッチン,間口=2170,対面I型,食洗機付,奥行き97cm
/KITCHEN/RIC_SI97,RIL97L2320syuR,キッチン,システムキッチン,,,リシェルSI,RIL97L2320syuR,R,システムキッチン,間口=2320,対面I型,,奥行き97cm
/KITCHEN/RIC_SI97,RIL97L2320syuL,キッチン,システムキッチン,,,リシェルSI,RIL97L2320syuL,L,システムキッチン,間口=2320,対面I型,,奥行き97cm
/KITCHEN/RIC_SI97,RIL97L2320syoR,キッチン,システムキッチン,,,リシェルSI,RIL97L2320syoR,R,システムキッチン,間口=2320,対面I型,食洗機付,奥行き97cm
/KITCHEN/RIC_SI97,RIL97L2320syoL,キッチン,システムキッチン,,,リシェルSI,RIL97L2320syoL,L,システムキッチン,間口=2320,対面I型,食洗機付,奥行き97cm
/KITCHEN/RIC_SI97,RIL97L2470syuR,キッチン,システムキッチン,,,リシェルSI,RIL97L2470syuR,R,システムキッチン,間口=2470,対面I型,,奥行き97cm
/KITCHEN/RIC_SI97,RIL97L2470syuL,キッチン,システムキッチン,,,リシェルSI,RIL97L2470syuL,L,システムキッチン,間口=2470,対面I型,,奥行き97cm
/KITCHEN/RIC_SI97,RIL97L2470syoR,キッチン,システムキッチン,,,リシェルSI,RIL97L2470syoR,R,システムキッチン,間口=2470,対面I型,食洗機付,奥行き97cm
/KITCHEN/RIC_SI97,RIL97L2470syoL,キッチン,システムキッチン,,,リシェルSI,RIL97L2470syoL,L,システムキッチン,間口=2470,対面I型,食洗機付,奥行き97cm
/KITCHEN/RIC_SI97,RIL97L2620syuR,キッチン,システムキッチン,,,リシェルSI,RIL97L2620syuR,R,システムキッチン,間口=2620,対面I型,,奥行き97cm
/KITCHEN/RIC_SI97,RIL97L2620syuL,キッチン,システムキッチン,,,リシェルSI,RIL97L2620syuL,L,システムキッチン,間口=2620,対面I型,,奥行き97cm
/KITCHEN/RIC_SI97,RIL97L2620syoR,キッチン,システムキッチン,,,リシェルSI,RIL97L2620syoR,R,システムキッチン,間口=2620,対面I型,食洗機付,奥行き97cm
/KITCHEN/RIC_SI97,RIL97L2620syoL,キッチン,システムキッチン,,,リシェルSI,RIL97L2620syoL,L,システムキッチン,間口=2620,対面I型,食洗機付,奥行き97cm
/KITCHEN/RIC_SI97,RIL97L2770syuR,キッチン,システムキッチン,,,リシェルSI,RIL97L2770syuR,R,システムキッチン,間口=2770,対面I型,,奥行き97cm
/KITCHEN/RIC_SI97,RIL97L2770syuL,キッチン,システムキッチン,,,リシェルSI,RIL97L2770syuL,L,システムキッチン,間口=2770,対面I型,,奥行き97cm
/KITCHEN/RIC_SI97,RIL97L2770syoR,キッチン,システムキッチン,,,リシェルSI,RIL97L2770syoR,R,システムキッチン,間口=2770,対面I型,食洗機付,奥行き97cm
/KITCHEN/RIC_SI97,RIL97L2770syoL,キッチン,システムキッチン,,,リシェルSI,RIL97L2770syoL,L,システムキッチン,間口=2770,対面I型,食洗機付,奥行き97cm
/KITCHEN/RIC_SP97,AAZD03D001,キッチン,システムキッチン,,,リシェルSI,AAZD03D001,R,システムキッチン,間口=2435,対面I型,,奥行き97cm
/KITCHEN/RIC_SP97,AAZD03D003,キッチン,システムキッチン,,,リシェルSI,AAZD03D003,L,システムキッチン,間口=2435,対面I型,,奥行き97cm
/KITCHEN/RIC_SP97,AAZD03D002,キッチン,システムキッチン,,,リシェルSI,AAZD03D002,R,システムキッチン,間口=2435,対面I型,食洗機付,奥行き97cm
/KITCHEN/RIC_SP97,AAZD03D004,キッチン,システムキッチン,,,リシェルSI,AAZD03D004,L,システムキッチン,間口=2435,対面I型,食洗機付,奥行き97cm
/KITCHEN/RIC_SP97,AAZD03C001,キッチン,システムキッチン,,,リシェルSI,AAZD03C001,R,システムキッチン,間口=2585,対面I型,,奥行き97cm
/KITCHEN/RIC_SP97,AAZD03C003,キッチン,システムキッチン,,,リシェルSI,AAZD03C003,L,システムキッチン,間口=2585,対面I型,,奥行き97cm
/KITCHEN/RIC_SP97,AAZD03C002,キッチン,システムキッチン,,,リシェルSI,AAZD03C002,R,システムキッチン,間口=2585,対面I型,食洗機付,奥行き97cm
/KITCHEN/RIC_SP97,AAZD03C004,キッチン,システムキッチン,,,リシェルSI,AAZD03C004,L,システムキッチン,間口=2585,対面I型,食洗機付,奥行き97cm
/KITCHEN/RIC_SP97,AAZD03C005,キッチン,システムキッチン,,,リシェルSI,AAZD03C005,R,システムキッチン,間口=2735,対面I型,,奥行き97cm
/KITCHEN/RIC_SP97,AAZD03C007,キッチン,システムキッチン,,,リシェルSI,AAZD03C007,L,システムキッチン,間口=2735,対面I型,,奥行き97cm
/KITCHEN/RIC_SP97,AAZD03C006,キッチン,システムキッチン,,,リシェルSI,AAZD03C006,R,システムキッチン,間口=2735,対面I型,食洗機付,奥行き97cm
/KITCHEN/RIC_SP97,AAZD03C008,キッチン,システムキッチン,,,リシェルSI,AAZD03C008,L,システムキッチン,間口=2735,対面I型,食洗機付,奥行き97cm
/KITCHEN/RIC_SI_PI1,01602618000000-101,キッチン,システムキッチン,,,リシェルSI,01602618000000-101,R,システムキッチン,間口=2735,対面I型,,奥行き97cm
/KITCHEN/RIC_SI_PI1,01602618000000-102,キッチン,システムキッチン,,,リシェルSI,01602618000000-102,L,システムキッチン,間口=2735,対面I型,,奥行き97cm
/KITCHEN/RIC_SI_PI1,01602618000000-103,キッチン,システムキッチン,,,リシェルSI,01602618000000-103,R,システムキッチン,間口=2735,対面I型,食洗機付,奥行き97cm
/KITCHEN/RIC_SI_PI1,01602618000000-104,キッチン,システムキッチン,,,リシェルSI,01602618000000-104,L,システムキッチン,間口=2735,対面I型,食洗機付,奥行き97cm
/KITCHEN/RIC_SI_PI1,01602618000000-105,キッチン,システムキッチン,,,リシェルSI,01602618000000-105,R,システムキッチン,間口=2585,対面I型,,奥行き97cm
/KITCHEN/RIC_SI_PI1,01602618000000-106,キッチン,システムキッチン,,,リシェルSI,01602618000000-106,L,システムキッチン,間口=2585,対面I型,,奥行き97cm